Please enable / Bitte aktiviere JavaScript!
Veuillez activer / Por favor activa el Javascript![ ? ]
What kind of compile error? - bug-code.com Q&A

What kind of compile error?

0 like 0 dislike
115 views
I downloaded the Drava to your Wi-Fi adapter tl-wn722n, but at compilation produces an error:
error: ‘_timer {aka struct timer_list}’ has no member named ‘data’
ptimer->data = (unsigned long)cntx;
^~
make[4]: *** [/usr/src/linux-headers-4.18.0-kali2-common/scripts/Makefile.build:323: /root/kernel/drivers/TL-WN722N_v2.0-Ralink/rtl8188EUS_linux_v4.3.0.8_13968.20150417/core/rtw_cmd.o] Error 1
make[3]: *** [/usr/src/linux-headers-4.18.0-kali2-common/Makefile:1531: _module_/root/kernel/drivers/TL-WN722N_v2.0-Ralink/rtl8188EUS_linux_v4.3.0.8_13968.20150417] Error 2
make[2]: *** [Makefile:146: sub-make] Error 2
make[1]: *** [Makefile:8: all] Error 2
make[1]: exit from directory "/usr/src/linux-headers-4.18.0-kali2-amd64"
make: *** [Makefile:1368: modules] Error 2
asked by | 115 views

1 Answer

0 like 0 dislike
I downloaded the Drava to your Wi-Fi adapter tl-wn722n

I would be looking here or here.
answered by
Welcome to Bug-code Q&A, where you can ask questions and receive answers from other members of the community.

24.8k questions

46.2k answers

0 comments

12.8k users

24,788 questions
46,220 answers
0 comments
12,813 users